BDBM154524 23VK (17g)
SMILES Oc1ccc(cc1)-c1sc2cc(O)ccc2c1-c1ccc(OCCN2CCCC2=O)cc1
InChI Key InChIKey=OXRSEGGULSREHB-UHFFFAOYSA-N
Data  3 IC50
  Tab Delimited (TSV)   2D SDfile   Computed 3D by Vconf -m prep SDfile
Find this compound or compounds like it in BindingDB:
Activity Spreadsheet -- Enzyme Inhibition Constant Data from BindingDB
Found 1 hit for monomerid = 154524
TargetPhospholipase D2(Homo sapiens (Human))
Vanderbilt University
LigandPNGBDBM154524(23VK (17g))
Affinity DataIC50:  3.50E+3nMpH: 7.5Assay Description:Briefly, PLD activity was measured as the release of free [3H]-choline from [choline-methyl-3H] dipalmitoylphosphatidylcholine ([3H]-DPPC). 3−5...
In DepthDetails ArticlePubMed